Reaction Details
TargetSubstance-P receptor
LigandBDBM50066190
Substrate/Competitorn/a
Meas. Tech.ChEMBL_205880 (CHEMBL813941)
Ki 3.8±n/a nM
Citation Walpole, CKo, SYBrown, MBeattie, DCampbell, EDickenson, FEwan, SHughes, GALemaire, MLerpiniere, JPatel, SUrban, L 2-Nitrophenylcarbamoyl-(S)-prolyl-(S)-3-(2-naphthyl)alanyl-N-benzyl-N - methylamide (SDZ NKT 343), a potent human NK1 tachykinin receptor antagonist with good oral analgesic activity in chronic pain models. J Med Chem41:3159-73 (1998) 
 
Substance-P receptor
Name:Substance-P receptor
Type:G Protein-Coupled Receptor (GPCR)
Mol. Mass.:46254.43
Organism:Homo sapiens (Human)
Description:P25103
Residue:407
BDBM50066190
NameBDBM50066190
Synonyms:(S)-Pyrrolidine-1,2-dicarboxylic acid 2-{[(S)-1-(benzyl-methyl-carbamoyl)-2-naphthalen-2-yl-ethyl]-amide} 1-[(2-methylcarbamoyl-phenyl)-amide] | CHEMBL419004
TypeSmall organic molecule
Emp. Form.C35H37N5O4
Mol. Mass.591.6994
SMILESCNC(=O)c1ccccc1NC(=O)N1CCC[C@H]1C(=O)N[C@@H](Cc1ccc2ccccc2c1)C(=O)N(C)Cc1ccccc1