Reaction Details
TargetSubstance-P receptor
LigandBDBM50066189
Substrate/Competitorn/a
Meas. Tech.ChEMBL_205880 (CHEMBL813941)
Ki 18±n/a nM
Citation Walpole, CKo, SYBrown, MBeattie, DCampbell, EDickenson, FEwan, SHughes, GALemaire, MLerpiniere, JPatel, SUrban, L 2-Nitrophenylcarbamoyl-(S)-prolyl-(S)-3-(2-naphthyl)alanyl-N-benzyl-N - methylamide (SDZ NKT 343), a potent human NK1 tachykinin receptor antagonist with good oral analgesic activity in chronic pain models. J Med Chem41:3159-73 (1998) 
 
Substance-P receptor
Name:Substance-P receptor
Type:G Protein-Coupled Receptor (GPCR)
Mol. Mass.:46254.43
Organism:Homo sapiens (Human)
Description:P25103
Residue:407
BDBM50066189
NameBDBM50066189
Synonyms:(S)-Pyrrolidine-1,2-dicarboxylic acid 2-{[(S)-1-(benzyl-methyl-carbamoyl)-2-naphthalen-2-yl-ethyl]-amide} 1-[(2-trifluoromethyl-phenyl)-amide] | CHEMBL108481
TypeSmall organic molecule
Emp. Form.C34H33F3N4O3
Mol. Mass.602.646
SMILESCN(Cc1ccccc1)C(=O)[C@H](Cc1ccc2ccccc2c1)NC(=O)[C@@H]1CCCN1C(=O)Nc1ccccc1C(F)(F)F