Reaction Details
TargetSubstance-P receptor
LigandBDBM50066236
Substrate/Competitorn/a
Meas. Tech.ChEMBL_205880 (CHEMBL813941)
Ki 5±n/a nM
Citation Walpole, CKo, SYBrown, MBeattie, DCampbell, EDickenson, FEwan, SHughes, GALemaire, MLerpiniere, JPatel, SUrban, L 2-Nitrophenylcarbamoyl-(S)-prolyl-(S)-3-(2-naphthyl)alanyl-N-benzyl-N - methylamide (SDZ NKT 343), a potent human NK1 tachykinin receptor antagonist with good oral analgesic activity in chronic pain models. J Med Chem41:3159-73 (1998) 
 
Substance-P receptor
Name:Substance-P receptor
Type:G Protein-Coupled Receptor (GPCR)
Mol. Mass.:46254.43
Organism:Homo sapiens (Human)
Description:P25103
Residue:407
BDBM50066236
NameBDBM50066236
Synonyms:(S)-1-(2-Chloro-benzylthiocarbamoyl)-pyrrolidine-2-carboxylic acid [(S)-1-(benzyl-methyl-carbamoyl)-2-(3,4-dichloro-phenyl)-ethyl]-amide | CHEMBL106217
TypeSmall organic molecule
Emp. Form.C30H31Cl3N4O2S
Mol. Mass.618.017
SMILESCN(Cc1ccccc1)C(=O)[C@H](Cc1ccc(Cl)c(Cl)c1)NC(=O)[C@@H]1CCCN1C(=S)NCc1ccccc1Cl