Reaction Details
TargetSubstance-P receptor
LigandBDBM50066237
Substrate/Competitorn/a
Meas. Tech.ChEMBL_208643 (CHEMBL816612)
Ki 330±n/a nM
Citation Walpole, CKo, SYBrown, MBeattie, DCampbell, EDickenson, FEwan, SHughes, GALemaire, MLerpiniere, JPatel, SUrban, L 2-Nitrophenylcarbamoyl-(S)-prolyl-(S)-3-(2-naphthyl)alanyl-N-benzyl-N - methylamide (SDZ NKT 343), a potent human NK1 tachykinin receptor antagonist with good oral analgesic activity in chronic pain models. J Med Chem41:3159-73 (1998) 
 
Substance-P receptor
Name:Substance-P receptor
Type:G Protein-Coupled Receptor (GPCR)
Mol. Mass.:46254.43
Organism:Homo sapiens (Human)
Description:P25103
Residue:407
BDBM50066237
NameBDBM50066237
Synonyms:(S)-1-(2-Methoxy-benzylthiocarbamoyl)-pyrrolidine-2-carboxylic acid benzhydryl-amide | CHEMBL431070
TypeSmall organic molecule
Emp. Form.C27H29N3O2S
Mol. Mass.459.603
SMILESCOc1ccccc1CNC(=S)N1CCC[C@H]1C(=O)NC(c1ccccc1)c1ccccc1