Reaction Details
TargetSubstance-P receptor
LigandBDBM50369385
Substrate/Competitorn/a
Meas. Tech.ChEMBL_208643 (CHEMBL816612)
Ki 260±n/a nM
Citation Walpole, CKo, SYBrown, MBeattie, DCampbell, EDickenson, FEwan, SHughes, GALemaire, MLerpiniere, JPatel, SUrban, L 2-Nitrophenylcarbamoyl-(S)-prolyl-(S)-3-(2-naphthyl)alanyl-N-benzyl-N - methylamide (SDZ NKT 343), a potent human NK1 tachykinin receptor antagonist with good oral analgesic activity in chronic pain models. J Med Chem41:3159-73 (1998) 
 
Substance-P receptor
Name:Substance-P receptor
Type:G Protein-Coupled Receptor (GPCR)
Mol. Mass.:46254.43
Organism:Homo sapiens (Human)
Description:P25103
Residue:407
BDBM50369385
NameBDBM50369385
Synonyms:CHEMBL1169523
TypeSmall organic molecule
Emp. Form.C31H36N4O3S
Mol. Mass.544.708
SMILESCOc1ccccc1CNC(=S)N1CCC[C@H]1C(=O)N[C@@H](Cc1ccccc1)C(=O)N(C)Cc1ccccc1