Reaction Details
TargetSubstance-P receptor
LigandBDBM50066245
Substrate/Competitorn/a
Meas. Tech.ChEMBL_205880 (CHEMBL813941)
Ki 2.6±n/a nM
Citation Walpole, CKo, SYBrown, MBeattie, DCampbell, EDickenson, FEwan, SHughes, GALemaire, MLerpiniere, JPatel, SUrban, L 2-Nitrophenylcarbamoyl-(S)-prolyl-(S)-3-(2-naphthyl)alanyl-N-benzyl-N - methylamide (SDZ NKT 343), a potent human NK1 tachykinin receptor antagonist with good oral analgesic activity in chronic pain models. J Med Chem41:3159-73 (1998) 
 
Substance-P receptor
Name:Substance-P receptor
Type:G Protein-Coupled Receptor (GPCR)
Mol. Mass.:46254.43
Organism:Homo sapiens (Human)
Description:P25103
Residue:407
BDBM50066245
NameBDBM50066245
Synonyms:(S)-Pyrrolidine-1,2-dicarboxylic acid 2-{[(S)-1-(benzyl-methyl-carbamoyl)-2-naphthalen-2-yl-ethyl]-amide} 1-[(2-hydroxy-phenyl)-amide] | CHEMBL106100
TypeSmall organic molecule
Emp. Form.C33H34N4O4
Mol. Mass.550.6475
SMILESCN(Cc1ccccc1)C(=O)[C@H](Cc1ccc2ccccc2c1)NC(=O)[C@@H]1CCCN1C(=O)Nc1ccccc1O