Reaction Details
TargetProgesterone receptor
LigandBDBM50066529
Substrate/Competitorn/a
Meas. Tech.ChEMBL_159543 (CHEMBL765659)
Ki 19±n/a nM
Citation Pooley, CLEdwards, JPGoldman, MEWang, MWMarschke, KBCrombie, DLJones, TK Discovery and preliminary SAR studies of a novel, nonsteroidal progesterone receptor antagonist pharmacophore. J Med Chem41:3461-6 (1998) 
 
Progesterone receptor
Name:Progesterone receptor
Type:Protein
Mol. Mass.:98979.52
Organism:Homo sapiens (Human)
Description:P06401
Residue:933
BDBM50066529
NameBDBM50066529
Synonyms:3-(2,2,4-Trimethyl-1,2-dihydro-quinolin-6-yl)-benzonitrile CHEMBL115904
TypeSmall organic molecule
Emp. Form.C19H18N2
Mol. Mass.274.3596
SMILESCC1=CC(C)(C)Nc2ccc(cc12)-c1cccc(c1)C#N