Reaction Details
TargetProgesterone receptor
LigandBDBM50366558
Substrate/Competitorn/a
Meas. Tech.ChEMBL_159543 (CHEMBL765659)
Ki 18±n/a nM
Citation Pooley, CLEdwards, JPGoldman, MEWang, MWMarschke, KBCrombie, DLJones, TK Discovery and preliminary SAR studies of a novel, nonsteroidal progesterone receptor antagonist pharmacophore. J Med Chem41:3461-6 (1998) 
 
Progesterone receptor
Name:Progesterone receptor
Type:Protein
Mol. Mass.:98979.52
Organism:Homo sapiens (Human)
Description:P06401
Residue:933
BDBM50366558
NameBDBM50366558
Synonyms:ONAPRISTONE | ZK-98299
TypeSmall organic molecule
Emp. Form.C29H39NO3
Mol. Mass.449.6249
SMILESCN(C)c1ccc(cc1)[C@H]1C[C@]2(C)[C@@H](CC[C@]2(O)CCCO)[C@@H]2CCC3=CC(=O)CCC3=C12