Reaction Details
TargetMu-type opioid receptor
LigandBDBM50066532
Substrate/Competitorn/a
Meas. Tech.ChEMBL_149015 (CHEMBL758579)
Ki 1.6±n/a nM
Citation Husbands, SMSadd, JBroadbear, JHWoods, JHMartin, JTraynor, JRAceto, MDBowman, ERHarris, LSLewis, JW 3-Alkyl ethers of clocinnamox: delayed long-term mu-antagonists with variable mu efficacy. J Med Chem41:3493-8 (1998) 
 
Mu-type opioid receptor
Name:Mu-type opioid receptor
Type:G Protein-Coupled Receptor (GPCR)
Mol. Mass.:44503.11
Organism:Rattus norvegicus (rat)
Description:Competition binding assays were carried out using membrane preparations from transfected HN9.10 cells that constitutively expressed the mu opioid receptor.
Residue:398
BDBM50066532
NameBDBM50066532
Synonyms:1N-[4-cyclopropylmethyl-14-oxo-10-(2-propynyloxy)-(17S)-12-oxa-4-azapentacyclo[9.6.1.01,13.05,17.07,18]octadeca-7,9,11(18)-trien-17-yl]-3-(4-chlorophenyl)-(E)-2-propenamide
TypeSmall organic molecule
Emp. Form.C32H31ClN2O4
Mol. Mass.543.053
SMILESClc1ccc(\C=C\C(=O)N[C@]23CCC(=O)[C@@H]4Oc5c6c(CC2N(CC2CC2)CC[C@@]346)ccc5OCC#C)cc1