Reaction Details
TargetNitric oxide synthase, inducible
LigandBDBM50225106
Substrate/Competitorn/a
Meas. Tech.ChEMBL_89190 (CHEMBL700508)
IC50 7600±n/a nM
Citation Hagen, TJBergmanis, AAKramer, SWFok, KFSchmelzer, AEPitzele, BSSwenton, LJerome, GMKornmeier, CMMoore, WMBranson, LFConnor, JRManning, PTCurrie, MGHallinan, EA 2-Iminopyrrolidines as potent and selective inhibitors of human inducible nitric oxide synthase. J Med Chem41:3675-83 (1998) 
 
Nitric oxide synthase, inducible
Name:Nitric oxide synthase, inducible
Type:Homodimer
Mol. Mass.:131141.95
Organism:Homo sapiens (Human)
Description:P35228
Residue:1153
BDBM50225106
NameBDBM50225106
Synonyms:(2S)-2-amino-5-{[(E)-amino(nitroimino)methyl]amino}pentanoic acid (2S)-2-amino-5-{[(E)-imino(nitroamino)methyl]amino}pentanoic acid (S)-2-Amino-5-(N'-nitro-guanidino)-pentanoic acid CHEMBL227744 N-nitro-L-arginine Ngamma-nitro-L-arginine | Nomega-nitro-L-arginine
TypeSmall organic molecule
Emp. Form.C6H13N5O4
Mol. Mass.219.1985
SMILESN[C@@H](CCCNC(N)=N[N+]([O-])=O)C(O)=O