Reaction Details
TargetNitric oxide synthase, endothelial
LigandBDBM50225106
Substrate/Competitorn/a
Meas. Tech.ChEMBL_65159 (CHEMBL678360)
IC50 500±n/a nM
Citation Hagen, TJBergmanis, AAKramer, SWFok, KFSchmelzer, AEPitzele, BSSwenton, LJerome, GMKornmeier, CMMoore, WMBranson, LFConnor, JRManning, PTCurrie, MGHallinan, EA 2-Iminopyrrolidines as potent and selective inhibitors of human inducible nitric oxide synthase. J Med Chem41:3675-83 (1998) 
 
Nitric oxide synthase, endothelial
Name:Nitric oxide synthase, endothelial
Type:Enzyme Catalytic Domain
Mol. Mass.:133297.84
Organism:Homo sapiens (Human)
Description:P29474
Residue:1203
BDBM50225106
NameBDBM50225106
Synonyms:(2S)-2-amino-5-{[(E)-amino(nitroimino)methyl]amino}pentanoic acid (2S)-2-amino-5-{[(E)-imino(nitroamino)methyl]amino}pentanoic acid (S)-2-Amino-5-(N'-nitro-guanidino)-pentanoic acid CHEMBL227744 N-nitro-L-arginine Ngamma-nitro-L-arginine | Nomega-nitro-L-arginine
TypeSmall organic molecule
Emp. Form.C6H13N5O4
Mol. Mass.219.1985
SMILESN[C@@H](CCCNC(N)=N[N+]([O-])=O)C(O)=O