Reaction Details
TargetP2Y purinoceptor 1
LigandBDBM50062287
Substrate/Competitorn/a
Meas. Tech.ChEMBL_162504 (CHEMBL767332)
IC50 5760±n/a nM
Citation Camaioni, EBoyer, JLMohanram, AHarden, TKJacobson, KA Deoxyadenosine bisphosphate derivatives as potent antagonists at P2Y1 receptors. J Med Chem41:183-90 (1998) 
 
P2Y purinoceptor 1
Name:P2Y purinoceptor 1
Type:n/a
Mol. Mass.:41199.64
Organism:Meleagris gallopavo
Description:n/a
Residue:362
BDBM50062287
NameBDBM50062287
Synonyms:CHEMBL298487 | Phosphoric acid mono-[5-(6-amino-purin-9-yl)-2-phosphonooxymethyl-tetrahydro-furan-3-yl] ester
TypeSmall organic molecule
Emp. Form.C10H15N5O9P2
Mol. Mass.411.2017
SMILESNc1ncnc2n(cnc12)C1CC(OP(O)(O)=O)C(COP(O)(O)=O)O1