Reaction Details
TargetP2Y purinoceptor 1
LigandBDBM50062291
Substrate/Competitorn/a
Meas. Tech.ChEMBL_162504 (CHEMBL767332)
IC50 324±n/a nM
Citation Camaioni, EBoyer, JLMohanram, AHarden, TKJacobson, KA Deoxyadenosine bisphosphate derivatives as potent antagonists at P2Y1 receptors. J Med Chem41:183-90 (1998) 
 
P2Y purinoceptor 1
Name:P2Y purinoceptor 1
Type:n/a
Mol. Mass.:41199.64
Organism:Meleagris gallopavo
Description:n/a
Residue:362
BDBM50062291
NameBDBM50062291
Synonyms:CHEMBL54116 | Phosphoric acid mono-[2-(6-methylamino-purin-9-yl)-5-phosphonooxymethyl-tetrahydro-furan-3-yl] ester
TypeSmall organic molecule
Emp. Form.C11H17N5O9P2
Mol. Mass.425.2283
SMILESCNc1ncnc2n(cnc12)C1OC(COP(O)(O)=O)CC1OP(O)(O)=O