Reaction Details
TargetIntegrase
LigandBDBM50059989
Substrate/Competitorn/a
Meas. Tech.ChEMBL_90571 (CHEMBL702428)
IC50>100000±n/a nM
Citation Artico, MDi Santo, RCosti, RNovellino, EGreco, GMassa, STramontano, EMarongiu, MEDe Montis, ALa Colla, P Geometrically and conformationally restrained cinnamoyl compounds as inhibitors of HIV-1 integrase: synthesis, biological evaluation, and molecular modeling. J Med Chem41:3948-60 (1998) 
 
Integrase
Name:Integrase
Synonyms:Human immunodeficiency virus type 1 integrase
Type:PROTEIN
Mol. Mass.:32231.48
Organism:Human immunodeficiency virus 1
Description:ChEMBL_90865
Residue:288
BDBM50059989
NameBDBM50059989
TypeSmall organic molecule
Emp. Form.C19H16O4
Mol. Mass.308.3279
SMILESOc1ccc(C=CC(=O)CC(=O)C=Cc2ccc(O)cc2)cc1