Reaction Details
TargetBeta-lactamase
LigandBDBM50067070
Substrate/Competitorn/a
Meas. Tech.ChEMBL_40259 (CHEMBL656489)
IC50 20±n/a nM
Citation Hubschwerlen, CAngehrn, PGubernator, KPage, MGSpecklin, JL Structure-based design of beta-lactamase inhibitors. 2. Synthesis and evaluation of bridged sulfactams and oxamazins. J Med Chem41:3972-5 (1998) 
 
Beta-lactamase
Name:Beta-lactamase
Type:PROTEIN
Mol. Mass.:41306.67
Organism:Enterobacter cloacae
Description:ChEMBL_40258
Residue:381
BDBM50067070
NameBDBM50067070
Synonyms:CHEMBL355579 | sodium salt -tert-butyl 7-oxo-6-(sulfooxy)-2,6-diazabicyclo[3.2.0]heptane-2-carboxylate
TypeSmall organic molecule
Emp. Form.C10H15N2O7S
Mol. Mass.307.301
SMILESCC(C)(C)OC(=O)N1CCC2C1C(=O)N2OS([O-])(=O)=O