Reaction Details
TargetB2 bradykinin receptor
LigandBDBM50067317
Substrate/Competitorn/a
Meas. Tech.ChEMBL_40265 (CHEMBL656501)
IC50 0.13±n/a nM
Citation Abe, YKayakiri, HSatoh, SInoue, TSawada, YInamura, NAsano, MAramori, IHatori, CSawai, HOku, TTanaka, H A novel class of orally active non-peptide bradykinin B2 receptor antagonists. 3. Discovering bioisosteres of the imidazo[1,2-a] pyridine moiety. J Med Chem41:4062-79 (1998) 
 
B2 bradykinin receptor
Name:B2 bradykinin receptor
Type:Enzyme Catalytic Domain
Mol. Mass.:44467.17
Organism:Homo sapiens (Human)
Description:B2 BRADYKININ BDKRB2 HUMAN::P30411
Residue:391
BDBM50067317
NameBDBM50067317
Synonyms:CHEMBL553614 | N-({[2,4-Dichloro-3-(2-methyl-quinolin-8-yloxymethyl)-phenyl]-methyl-carbamoyl}-methyl)-3-[6-(2-oxo-pyrrolidin-1-yl)-pyridin-3-yl]-acrylamide; dihydrochloride
TypeSmall organic molecule
Emp. Form.C32H29Cl2N5O4
Mol. Mass.618.51
SMILESCN(C(=O)CNC(=O)\C=C\c1ccc(nc1)N1CCCC1=O)c1ccc(Cl)c(COc2cccc3ccc(C)nc23)c1Cl