Reaction Details
TargetAcetylcholinesterase
LigandBDBM120262
Substrate/Competitorn/a
Meas. Tech.ChEMBL_28747 (CHEMBL641011)
Ki 1.6±n/a nM
Citation Melchiorre, CAndrisano, VBolognesi, MLBudriesi, RCavalli, ACavrini, VRosini, MTumiatti, VRecanatini, M Acetylcholinesterase noncovalent inhibitors based on a polyamine backbone for potential use against Alzheimer's disease. J Med Chem41:4186-9 (1998) 
 
Acetylcholinesterase
Name:Acetylcholinesterase
Type:Enzyme
Mol. Mass.:67792.70
Organism:Homo sapiens (Human)
Description:P22303
Residue:614
BDBM120262
NameBDBM120262
Synonyms:EDROPHONIUM BROMIDE Edrophonium cid_8307
TypeSmall organic molecule
Emp. Form.C10H16NO
Mol. Mass.166.2396
SMILESCC[N+](C)(C)c1cccc(O)c1