Reaction Details
TargetGonadotropin-releasing hormone receptor
LigandBDBM50369395
Substrate/Competitorn/a
Meas. Tech.ChEMBL_100013 (CHEMBL709251)
IC50 0.30±n/a nM
Citation Cho, NHarada, MImaeda, TImada, TMatsumoto, HHayase, YSasaki, SFuruya, SSuzuki, NOkubo, SOgi, KEndo, SOnda, HFujino, M Discovery of a novel, potent, and orally active nonpeptide antagonist of the human luteinizing hormone-releasing hormone (LHRH) receptor. J Med Chem41:4190-5 (1998) 
 
Gonadotropin-releasing hormone receptor
Name:Gonadotropin-releasing hormone receptor
Type:Enzyme
Mol. Mass.:37749.45
Organism:Homo sapiens (Human)
Description:P30968
Residue:328
BDBM50369395
NameBDBM50369395
Synonyms:ELIGARD | LEUPROLIDE
TypeSmall organic molecule
Emp. Form.C59H84N16O12
Mol. Mass.1209.3983
SMILESCCNC(=O)[C@@H]1CCCN1C(=O)[C@H](CCCNC(N)=N)NC(=O)[C@H](CC(C)C)NC(=O)[C@@H](CC(C)C)NC(=O)[C@H](Cc1ccc(O)cc1)NC(=O)[C@H](CO)NC(=O)[C@H](Cc1c[nH]c2ccccc12)NC(=O)[C@H](Cc1cnc[nH]1)NC(=O)[C@@H]1CCC(=O)N1