Reaction Details
TargetP-selectin
LigandBDBM50422275
Substrate/Competitorn/a
Meas. Tech.ChEMBL_200031 (CHEMBL873252)
IC50 380±n/a nM
Citation Tsukida, TMoriyama, HKurokawa, KAchiha, TInoue, YKondo, H Studies on selectin blockers. 7. Structure-activity relationships of sialyl Lewis X mimetics based on modified Ser-Glu dipeptides. J Med Chem41:4279-87 (1998) 
 
P-selectin
Name:P-selectin
Type:PROTEIN
Mol. Mass.:90834.61
Organism:Homo sapiens (Human)
Description:ChEMBL_1438999
Residue:830
BDBM50422275
NameBDBM50422275
Synonyms:CHEMBL2303665
TypeSmall organic molecule
Emp. Form.C45H85N3O11
Mol. Mass.844.1699
(CCCCCCCCCCCCCC)C(=O)N[C@@H](CO[C@H]1O[C@H](CO)[C@@H](O)[C@@H](O)[C@@H]1O)C(=O)N[C@H](CCC(O)=O)C(=O)NC