Reaction Details
TargetCathepsin B
LigandBDBM50157741
Substrate/Competitorn/a
Meas. Tech.ChEMBL_47416 (CHEMBL657293)
IC50 16±n/a nM
Citation Yasuma, TOi, SChoh, NNomura, TFuruyama, NNishimura, AFujisawa, YSohda, T Synthesis of peptide aldehyde derivatives as selective inhibitors of human cathepsin L and their inhibitory effect on bone resorption. J Med Chem41:4301-8 (1998) 
 
Cathepsin B
Name:Cathepsin B
Type:Enzyme
Mol. Mass.:37819.69
Organism:Homo sapiens (Human)
Description:gi_63102437
Residue:339
BDBM50157741
NameBDBM50157741
Synonyms:CHEMBL374508 E64
TypeSmall organic molecule
Emp. Form.C15H27N5O5
Mol. Mass.357.4054
SMILES[#6]-[#6](-[#6])-[#6]-[#6@H](-[#7]-[#6](=O)-[#6@H]-1-[#8]-[#6@@H]-1-[#6](-[#8])=O)-[#6](=O)-[#7]-[#6]-[#6]-[#6]-[#6]\[#7]=[#6](/[#7])-[#7]