Reaction Details
TargetCathepsin B
LigandBDBM50369400
Substrate/Competitorn/a
Meas. Tech.ChEMBL_47416 (CHEMBL657293)
IC50 440±n/a nM
Citation Yasuma, TOi, SChoh, NNomura, TFuruyama, NNishimura, AFujisawa, YSohda, T Synthesis of peptide aldehyde derivatives as selective inhibitors of human cathepsin L and their inhibitory effect on bone resorption. J Med Chem41:4301-8 (1998) 
 
Cathepsin B
Name:Cathepsin B
Type:Enzyme
Mol. Mass.:37819.69
Organism:Homo sapiens (Human)
Description:gi_63102437
Residue:339
BDBM50369400
NameBDBM50369400
Synonyms:CHEMBL1791000
TypeSmall organic molecule
Emp. Form.C24H28N4O2S
Mol. Mass.436.57
SMILESCC[C@@H](C)[C@H](NC(=S)Nc1ccccc1)C(=O)N[C@H](Cc1c[nH]c2ccccc12)C=O