Reaction Details
TargetProcathepsin L
LigandBDBM50369405
Substrate/Competitorn/a
Meas. Tech.ChEMBL_48494 (CHEMBL660643)
IC50 2±n/a nM
Citation Yasuma, TOi, SChoh, NNomura, TFuruyama, NNishimura, AFujisawa, YSohda, T Synthesis of peptide aldehyde derivatives as selective inhibitors of human cathepsin L and their inhibitory effect on bone resorption. J Med Chem41:4301-8 (1998) 
 
Procathepsin L
Name:Procathepsin L
Type:Enzyme
Mol. Mass.:37557.19
Organism:Homo sapiens (Human)
Description:Purchased from Calbiochem (San Diego, CA).
Residue:333
BDBM50369405
NameBDBM50369405
Synonyms:CHEMBL1790991
TypeSmall organic molecule
Emp. Form.C25H27F3N4O3
Mol. Mass.488.5021
SMILESCC[C@@H](C)[C@H](NC(=O)Nc1ccccc1C(F)(F)F)C(=O)N[C@H](Cc1c[nH]c2ccccc12)C=O