Reaction Details
TargetProcathepsin L
LigandBDBM50067597
Substrate/Competitorn/a
Meas. Tech.ChEMBL_48494 (CHEMBL660643)
IC50 2.2±n/a nM
Citation Yasuma, TOi, SChoh, NNomura, TFuruyama, NNishimura, AFujisawa, YSohda, T Synthesis of peptide aldehyde derivatives as selective inhibitors of human cathepsin L and their inhibitory effect on bone resorption. J Med Chem41:4301-8 (1998) 
 
Procathepsin L
Name:Procathepsin L
Type:Enzyme
Mol. Mass.:37557.19
Organism:Homo sapiens (Human)
Description:Purchased from Calbiochem (San Diego, CA).
Residue:333
BDBM50067597
NameBDBM50067597
Synonyms:(S)-4-Methyl-2-(naphthalene-1-sulfonylamino)-pentanoic acid [(R)-1-formyl-2-(1H-indol-3-yl)-ethyl]-amide | CHEMBL341577
TypeSmall organic molecule
Emp. Form.C27H29N3O4S
Mol. Mass.491.602
SMILESCC(C)C[C@H](NS(=O)(=O)c1cccc2ccccc12)C(=O)N[C@H](Cc1c[nH]c2ccccc12)C=O