Reaction Details
TargetProcathepsin L
LigandBDBM50067606
Substrate/Competitorn/a
Meas. Tech.ChEMBL_48494 (CHEMBL660643)
IC50 0.95±n/a nM
Citation Yasuma, TOi, SChoh, NNomura, TFuruyama, NNishimura, AFujisawa, YSohda, T Synthesis of peptide aldehyde derivatives as selective inhibitors of human cathepsin L and their inhibitory effect on bone resorption. J Med Chem41:4301-8 (1998) 
 
Procathepsin L
Name:Procathepsin L
Type:Enzyme
Mol. Mass.:37557.19
Organism:Homo sapiens (Human)
Description:Purchased from Calbiochem (San Diego, CA).
Residue:333
BDBM50067606
NameBDBM50067606
Synonyms:(S)-3-Methyl-2-(naphthalene-1-sulfonylamino)-pentanoic acid ((S)-1-formyl-3-methyl-butyl)-amide | CHEMBL134494
TypeSmall organic molecule
Emp. Form.C22H30N2O4S
Mol. Mass.418.55
SMILESCCC(C)[C@H](NS(=O)(=O)c1cccc2ccccc12)C(=O)N[C@@H](CC(C)C)C=O