Reaction Details
TargetProcathepsin L
LigandBDBM50369404
Substrate/Competitorn/a
Meas. Tech.ChEMBL_48494 (CHEMBL660643)
IC50 7.1±n/a nM
Citation Yasuma, TOi, SChoh, NNomura, TFuruyama, NNishimura, AFujisawa, YSohda, T Synthesis of peptide aldehyde derivatives as selective inhibitors of human cathepsin L and their inhibitory effect on bone resorption. J Med Chem41:4301-8 (1998) 
 
Procathepsin L
Name:Procathepsin L
Type:Enzyme
Mol. Mass.:37557.19
Organism:Homo sapiens (Human)
Description:Purchased from Calbiochem (San Diego, CA).
Residue:333
BDBM50369404
NameBDBM50369404
Synonyms:CHEMBL1790998
TypeSmall organic molecule
Emp. Form.C25H29N3O4
Mol. Mass.435.5155
SMILESCC[C@@H](C)[C@H](NC(=O)OCc1ccccc1)C(=O)N[C@H](Cc1c[nH]c2ccccc12)C=O