Reaction Details
TargetProcathepsin L
LigandBDBM50067613
Substrate/Competitorn/a
Meas. Tech.ChEMBL_48494 (CHEMBL660643)
IC50 1.4±n/a nM
Citation Yasuma, TOi, SChoh, NNomura, TFuruyama, NNishimura, AFujisawa, YSohda, T Synthesis of peptide aldehyde derivatives as selective inhibitors of human cathepsin L and their inhibitory effect on bone resorption. J Med Chem41:4301-8 (1998) 
 
Procathepsin L
Name:Procathepsin L
Type:Enzyme
Mol. Mass.:37557.19
Organism:Homo sapiens (Human)
Description:Purchased from Calbiochem (San Diego, CA).
Residue:333
BDBM50067613
NameBDBM50067613
Synonyms:(S)-3-Methyl-2-(naphthalene-1-sulfonylamino)-pentanoic acid [(S)-1-(4-hydroxy-benzyl)-2-oxo-ethyl]-amide | CHEMBL336415
TypeSmall organic molecule
Emp. Form.C25H28N2O5S
Mol. Mass.468.565
SMILESCCC(C)[C@H](NS(=O)(=O)c1cccc2ccccc12)C(=O)N[C@@H](Cc1ccc(O)cc1)C=O