Reaction Details
TargetD(2) dopamine receptor
LigandBDBM60917
Substrate/Competitorn/a
Meas. Tech.ChEMBL_60374 (CHEMBL672210)
Ki 810±n/a nM
Citation Wilcox, RETseng, TBrusniak, MYGinsburg, BPearlman, RSTeeter, MDuRand, CStarr, SNeve, KA CoMFA-based prediction of agonist affinities at recombinant D1 vs D2 dopamine receptors. J Med Chem41:4385-99 (1998) 
 
D(2) dopamine receptor
Name:D(2) dopamine receptor
Type:Cell-surface receptors
Mol. Mass.:50647.10
Organism:Homo sapiens (Human)
Description:P14416
Residue:443
BDBM60917
NameBDBM60917
Synonyms:9-chloranyl-5-(4-hydroxyphenyl)-2,3,4,5-tetrahydro-1H-3-benzazepine-7,8-diol;methanesulfonic acid 9-chloro-5-(4-hydroxyphenyl)-2,3,4,5-tetrahydro-1H-3-benzazepine-7,8-diol;methanesulfonic acid FENOLDOPAM MESYLATE SMR000469190 | cid_49659
TypeSmall organic molecule
Emp. Form.C16H16ClNO3
Mol. Mass.305.756
SMILESOc1ccc(cc1)C1CNCCc2c(Cl)c(O)c(O)cc12