Reaction Details
TargetCannabinoid receptor 1
LigandBDBM50067737
Substrate/Competitorn/a
Meas. Tech.ChEMBL_46827 (CHEMBL658061)
Ki 3±n/a nM
Citation Singer, MRyan, WJSaha, BMartin, BRRazdan, RK Potent cyano and carboxamido side-chain analogues of 1', 1'-dimethyl-delta8-tetrahydrocannabinol. J Med Chem41:4400-7 (1998) 
 
Cannabinoid receptor 1
Name:Cannabinoid receptor 1
Type:G Protein-Coupled Receptor (GPCR)
Mol. Mass.:52868.96
Organism:Homo sapiens (Human)
Description:P21554
Residue:472
BDBM50067737
NameBDBM50067737
Synonyms:4-(5-((6aR,10aR)-1-hydroxy-6,6,9-trimethyl-6a,7,10,10a-tetrahydro-6H-benzo[c]chromen-3-yl)-5-methylhexyloxy)benzonitrile CHEMBL136120
TypeSmall organic molecule
Emp. Form.C30H37NO3
Mol. Mass.459.6197
SMILESCC1=CC[C@@H]2[C@@H](C1)c1c(O)cc(cc1OC2(C)C)C(C)(C)CCCCOc1ccc(cc1)C#N