Reaction Details
TargetCannabinoid receptor 1
LigandBDBM50067741
Substrate/Competitorn/a
Meas. Tech.ChEMBL_46827 (CHEMBL658061)
Ki 0.86±n/a nM
Citation Singer, MRyan, WJSaha, BMartin, BRRazdan, RK Potent cyano and carboxamido side-chain analogues of 1', 1'-dimethyl-delta8-tetrahydrocannabinol. J Med Chem41:4400-7 (1998) 
 
Cannabinoid receptor 1
Name:Cannabinoid receptor 1
Type:G Protein-Coupled Receptor (GPCR)
Mol. Mass.:52868.96
Organism:Homo sapiens (Human)
Description:P21554
Residue:472
BDBM50067741
NameBDBM50067741
Synonyms:6-((6aR,10aR)-1-Hydroxy-6,6,9-trimethyl-6a,7,10,10a-tetrahydro-6H-benzo[c]chromen-3-yl)-6-methyl-heptanoic acid dimethylamide | CHEMBL344455
TypeSmall organic molecule
Emp. Form.C26H39NO3
Mol. Mass.413.5928
SMILESCN(C)C(=O)CCCCC(C)(C)c1cc(O)c2[C@@H]3CC(C)=CC[C@H]3C(C)(C)Oc2c1