Reaction Details
TargetKappa-type opioid receptor
LigandBDBM50346950
Substrate/Competitorn/a
Meas. Tech.ChEMBL_145834 (CHEMBL755492)
Ki 0.090000±n/a nM
Citation Jones, RMHjorth, SASchwartz, TWPortoghese, PS Mutational evidence for a common kappa antagonist binding pocket in the wild-type kappa and mutant mu[K303E] opioid receptors. J Med Chem41:4911-4 (1999) 
 
Kappa-type opioid receptor
Name:Kappa-type opioid receptor
Type:G Protein-Coupled Receptor (GPCR)
Mol. Mass.:42692.90
Organism:Rattus norvegicus (rat)
Description:P34975
Residue:380
BDBM50346950
NameBDBM50346950
Synonyms:CHEMBL485832
TypeSmall organic molecule
Emp. Form.C27H29N5O3
Mol. Mass.471.5509
SMILESNC(N)=Nc1ccc2[nH]c3[C@@H]4Oc5c6c(C[C@H]7N(CC8CC8)CC[C@@]46[C@@]7(O)Cc3c2c1)ccc5O