Reaction Details
TargetKappa-type opioid receptor
LigandBDBM50068379
Substrate/Competitorn/a
Meas. Tech.ChEMBL_145843 (CHEMBL755501)
Ki 0.290000±n/a nM
Citation Jones, RMHjorth, SASchwartz, TWPortoghese, PS Mutational evidence for a common kappa antagonist binding pocket in the wild-type kappa and mutant mu[K303E] opioid receptors. J Med Chem41:4911-4 (1999) 
 
Kappa-type opioid receptor
Name:Kappa-type opioid receptor
Type:G Protein-Coupled Receptor (GPCR)
Mol. Mass.:42692.90
Organism:Rattus norvegicus (rat)
Description:P34975
Residue:380
BDBM50068379
NameBDBM50068379
Synonyms:5'-[N-(N'-Cyano)guanidinyl]-17-cyclopropylmethyl-6,7-didehydro-4,5alpha-epoxy-3,14-dihydroxyindolo[2',3':6,7]morphinan cyno-C5'-guanidinyl naltrindole
TypeSmall organic molecule
Emp. Form.C28H28N6O3
Mol. Mass.496.5603
SMILESNC(Nc1ccc2[nH]c3[C@@H]4Oc5c6c(CC7N(CC8CC8)CC[C@@]46[C@@]7(O)Cc3c2c1)ccc5O)=NC#N