Reaction Details
TargetD(2) dopamine receptor
LigandBDBM84637
Substrate/Competitorn/a
Meas. Tech.ChEMBL_61319 (CHEMBL670094)
Ki 59±n/a nM
Citation Cervetto, LDemontis, GCGiannaccini, GLongoni, BMacchia, BMacchia, MMartinelli, AOrlandini, E N-n-Propyl-substituted 3-(dimethylphenyl)piperidines display novel discriminative properties between dopamine receptor subtypes: synthesis and receptor binding studies. J Med Chem41:4933-8 (1999) 
 
D(2) dopamine receptor
Name:D(2) dopamine receptor
Type:Enzyme Catalytic Domain
Mol. Mass.:50698.79
Organism:BOVINE
Description:P20288
Residue:444
BDBM84637
NameBDBM84637
Synonyms:CAS_85760-74-3 NSC_54562 Quinpirole,(-) | US9359372, Quinpirole
TypeSmall organic molecule
Emp. Form.C13H21N3
Mol. Mass.219.3259
SMILESCCCN1CCC[C@@H]2Cc3[nH]ncc3C[C@@H]12