Reaction Details
TargetSodium-dependent dopamine transporter
LigandBDBM50068481
Substrate/Competitorn/a
Meas. Tech.ChEMBL_62340 (CHEMBL674432)
Ki 4.6±n/a nM
Citation Kozikowski, APAraldi, GLPrakash, KRZhang, MJohnson, KM Synthesis and biological properties of new 2beta-alkyl- and 2beta-aryl-3-(substituted phenyl)tropane derivatives: stereochemical effect of C-3 on affinity and selectivity for neuronal dopamine and serotonin transporters. J Med Chem41:4973-82 (1999) 
 
Sodium-dependent dopamine transporter
Name:Sodium-dependent dopamine transporter
Type:Multi-pass membrane protein
Mol. Mass.:68749.45
Organism:Rattus norvegicus (rat)
Description:P23977
Residue:619
BDBM50068481
NameBDBM50068481
Synonyms:(2S,3R,5R)-3-(4-Fluoro-phenyl)-8-methyl-2-phenyl-8-aza-bicyclo[3.2.1]octane | CHEMBL146195
TypeSmall organic molecule
Emp. Form.C20H22FN
Mol. Mass.295.3938
SMILESCN1[C@@H]2CCC1[C@@H]([C@@H](C2)c1ccc(F)cc1)c1ccccc1