Reaction Details
TargetPeptidyl-prolyl cis-trans isomerase FKBP1A
LigandBDBM50068553
Substrate/Competitorn/a
Meas. Tech.ChEMBL_66273 (CHEMBL678143)
Ki 15±n/a nM
Citation Hamilton, GSSteiner, JP Immunophilins: beyond immunosuppression. J Med Chem41:5119-43 (1999) 
 
Peptidyl-prolyl cis-trans isomerase FKBP1A
Name:Peptidyl-prolyl cis-trans isomerase FKBP1A
Type:Isomerase
Mol. Mass.:11953.09
Organism:Homo sapiens (Human)
Description:P62942
Residue:108
BDBM50068553
NameBDBM50068553
Synonyms:1-(3,3-Dimethyl-2-oxo-pentanoyl)-piperidine-2-carboxylic acid 1-ethyl-2-(4-methoxy-phenyl)-4-phenyl-butyl ester | CHEMBL146919
TypeSmall organic molecule
Emp. Form.C32H43NO5
Mol. Mass.521.6875
SMILESCCC(OC(=O)C1CCCCN1C(=O)C(=O)C(C)(C)CC)C(CCc1ccccc1)c1ccc(OC)cc1