Reaction Details
TargetPeptidyl-prolyl cis-trans isomerase FKBP1A
LigandBDBM50068568
Substrate/Competitorn/a
Meas. Tech.ChEMBL_66273 (CHEMBL678143)
Ki 18±n/a nM
Citation Hamilton, GSSteiner, JP Immunophilins: beyond immunosuppression. J Med Chem41:5119-43 (1999) 
 
Peptidyl-prolyl cis-trans isomerase FKBP1A
Name:Peptidyl-prolyl cis-trans isomerase FKBP1A
Type:Isomerase
Mol. Mass.:11953.09
Organism:Homo sapiens (Human)
Description:P62942
Residue:108
BDBM50068568
NameBDBM50068568
Synonyms:1-[2-Oxo-2-(3,4,5-trimethoxy-phenyl)-acetyl]-piperidine-2-carboxylic acid 3-phenoxy-benzyl ester | CHEMBL150062
TypeSmall organic molecule
Emp. Form.C30H31NO8
Mol. Mass.533.569
SMILESCOc1cc(cc(OC)c1OC)C(=O)C(=O)N1CCCCC1C(=O)OCc1cccc(Oc2ccccc2)c1