Reaction Details
TargetPeptidyl-prolyl cis-trans isomerase FKBP1A
LigandBDBM50068594
Substrate/Competitorn/a
Meas. Tech.ChEMBL_66273 (CHEMBL678143)
Ki 20±n/a nM
Citation Hamilton, GSSteiner, JP Immunophilins: beyond immunosuppression. J Med Chem41:5119-43 (1999) 
 
Peptidyl-prolyl cis-trans isomerase FKBP1A
Name:Peptidyl-prolyl cis-trans isomerase FKBP1A
Type:Isomerase
Mol. Mass.:11953.09
Organism:Homo sapiens (Human)
Description:P62942
Residue:108
BDBM50068594
NameBDBM50068594
Synonyms:1-(3,3-Dimethyl-2-oxo-pentanoyl)-piperidine-2-carboxylic acid 1-phenethyl-3-phenyl-propyl ester | CHEMBL417908
TypeSmall organic molecule
Emp. Form.C30H39NO4
Mol. Mass.477.635
SMILESCCC(C)(C)C(=O)C(=O)N1CCCCC1C(=O)OC(CCc1ccccc1)CCc1ccccc1