Reaction Details
TargetMu-type opioid receptor
LigandBDBM50455188
Substrate/Competitorn/a
Meas. Tech.ChEMBL_148851 (CHEMBL756647)
Ki>10000±n/a nM
Citation Tourwé, DMannekens, EDiem, TNVerheyden, PJaspers, HTóth, GPéter, AKertész, ITörök, GChung, NNSchiller, PW Side chain methyl substitution in the delta-opioid receptor antagonist TIPP has an important effect on the activity profile. J Med Chem41:5167-76 (1999) 
 
Mu-type opioid receptor
Name:Mu-type opioid receptor
Type:G Protein-Coupled Receptor (GPCR)
Mol. Mass.:44503.11
Organism:Rattus norvegicus (rat)
Description:Competition binding assays were carried out using membrane preparations from transfected HN9.10 cells that constitutively expressed the mu opioid receptor.
Residue:398
BDBM50455188
NameBDBM50455188
Synonyms:CHEMBL2371025
TypeSmall organic molecule
Emp. Form.C38H41N5O5
Mol. Mass.647.7626
SMILESC[C@H]([C@@H](NC(=O)[C@H](Cc1ccccc1)NC(=O)[C@@H]1Cc2ccccc2CN1C(=O)[C@@H](N)Cc1ccc(O)cc1)C(N)=O)c1ccccc1