Reaction Details
TargetCannabinoid receptor 1
LigandBDBM50068667
Substrate/Competitorn/a
Meas. Tech.ChEMBL_46303 (CHEMBL663447)
Ki 148±n/a nM
Citation Reggio, PHBasu-Dutt, SBarnett-Norris, JCastro, MTHurst, DPSeltzman, HHRoche, MJGilliam, AFThomas, BFStevenson, LAPertwee, RGAbood, ME The bioactive conformation of aminoalkylindoles at the cannabinoid CB1 and CB2 receptors: insights gained from (E)- and (Z)-naphthylidene indenes. J Med Chem41:5177-87 (1999) 
 
Cannabinoid receptor 1
Name:Cannabinoid receptor 1
Type:G Protein-Coupled Receptor (GPCR)
Mol. Mass.:52868.96
Organism:Homo sapiens (Human)
Description:P21554
Residue:472
BDBM50068667
NameBDBM50068667
Synonyms:4-(2-{3-[1-Naphthalen-1-yl-meth-(Z)-ylidene]-3H-inden-1-yl}-ethyl)-morpholine | CHEMBL148805
TypeSmall organic molecule
Emp. Form.C26H25NO
Mol. Mass.367.4828
SMILESC(CC1=C\C(=C\c2cccc3ccccc23)c2ccccc12)N1CCOCC1