Reaction Details
TargetKappa-type opioid receptor
LigandBDBM50291970
Substrate/Competitorn/a
Meas. Tech.ChEMBL_146675 (CHEMBL753167)
Ki 1±n/a nM
Citation Thomas, JBFall, MJCooper, JBRothman, RBMascarella, SWXu, HPartilla, JSDersch, CMMcCullough, KBCantrell, BEZimmerman, DMCarroll, FI Identification of an opioid kappa receptor subtype-selective N-substituent for (+)-(3R,4R)-dimethyl-4-(3-hydroxyphenyl)piperidine. J Med Chem41:5188-97 (1999) 
 
Kappa-type opioid receptor
Name:Kappa-type opioid receptor
Type:G Protein-Coupled Receptor (GPCR)
Mol. Mass.:42744.99
Organism:Cavia porcellus (domestic guinea pig)
Description:P41144
Residue:380
BDBM50291970
NameBDBM50291970
Synonyms:3-[(3S,4S)-3,4-Dimethyl-1-((E)-3-phenyl-allyl)-piperidin-4-yl]-phenol | CHEMBL150052
TypeSmall organic molecule
Emp. Form.C22H27NO
Mol. Mass.321.4559
SMILESC[C@@H]1CN(C\C=C\c2ccccc2)CC[C@]1(C)c1cccc(O)c1