Reaction Details
TargetKappa-type opioid receptor
LigandBDBM50291973
Substrate/Competitorn/a
Meas. Tech.ChEMBL_146372 (CHEMBL759292)
Ki 8.8±n/a nM
Citation Thomas, JBFall, MJCooper, JBRothman, RBMascarella, SWXu, HPartilla, JSDersch, CMMcCullough, KBCantrell, BEZimmerman, DMCarroll, FI Identification of an opioid kappa receptor subtype-selective N-substituent for (+)-(3R,4R)-dimethyl-4-(3-hydroxyphenyl)piperidine. J Med Chem41:5188-97 (1999) 
 
Kappa-type opioid receptor
Name:Kappa-type opioid receptor
Type:G Protein-Coupled Receptor (GPCR)
Mol. Mass.:42744.99
Organism:Cavia porcellus (domestic guinea pig)
Description:P41144
Residue:380
BDBM50291973
NameBDBM50291973
Synonyms:3-(4-Hydroxy-phenyl)-N-{(S)-1-[4-(3-hydroxy-phenyl)-3,4-dimethyl-piperidin-1-ylmethyl]-2-methyl-butyl}-propionamide | CHEMBL151243
TypeSmall organic molecule
Emp. Form.C28H40N2O3
Mol. Mass.452.6288
SMILESCCC(C)[C@@H](CN1CCC(C)(C(C)C1)c1cccc(O)c1)NC(=O)CCc1ccc(O)cc1