Reaction Details
TargetMethylated-DNA--protein-cysteine methyltransferase
LigandBDBM50068783
Substrate/Competitorn/a
Meas. Tech.ChEMBL_144712 (CHEMBL751007)
IC50 120±n/a nM
Citation McElhinney, RSDonnelly, DJMcCormick, JEKelly, JWatson, AJRafferty, JAElder, RHMiddleton, MRWillington, MAMcMurry, TBMargison, GP Inactivation of O6-alkylguanine-DNA alkyltransferase. 1. Novel O6-(hetarylmethyl)guanines having basic rings in the side chain. J Med Chem41:5265-71 (1999) 
 
Methylated-DNA--protein-cysteine methyltransferase
Name:Methylated-DNA--protein-cysteine methyltransferase
Type:PROTEIN
Mol. Mass.:21651.27
Organism:Homo sapiens (Human)
Description:ChEMBL_144711
Residue:207
BDBM50068783
NameBDBM50068783
Synonyms:6-(Furan-2-ylmethoxy)-6,9-dihydro-1H-purin-2-ylamine | CHEMBL146768
TypeSmall organic molecule
Emp. Form.C10H11N5O2
Mol. Mass.233.2266
SMILESNC1=Nc2nc[nH]c2C(N1)OCc1ccco1