Reaction Details
TargetDihydrofolate reductase
LigandBDBM50011320
Substrate/Competitorn/a
Meas. Tech.ChEMBL_54279 (CHEMBL669872)
Ki 0.000±n/a nM
Citation Rosowsky, AWright, JEVaidya, CMBader, HForsch, RAMota, CEPardo, JChen, CSChen, YN Synthesis and potent antifolate activity and cytotoxicity of B-ring deaza analogues of the nonpolyglutamatable dihydrofolate reductase inhibitor Nalpha-(4-amino-4-deoxypteroyl)-Ndelta-hemiphthaloyl- L-ornithine (PT523). J Med Chem41:5310-9 (1999) 
 
Dihydrofolate reductase
Name:Dihydrofolate reductase
Type:Enzyme
Mol. Mass.:21453.99
Organism:Homo sapiens (Human)
Description:Recombinant human DHFR.
Residue:187
BDBM50011320
NameBDBM50011320
Synonyms:CHEMBL18155 N-(4-Carboxy-4-{4-[(2,4-diamino-pteridin-6-ylmethyl)-amino]-benzoylamino}-butyl)-phthalamic acid(PT523)
TypeSmall organic molecule
Emp. Form.C27H27N9O6
Mol. Mass.573.56
SMILESNc1nc(N)c2nc(CNc3ccc(cc3)C(=O)NC(CCCNC(=O)c3ccccc3C(O)=O)C(O)=O)cnc2n1