Reaction Details
TargetVoltage-dependent L-type calcium channel subunit alpha-1D
LigandBDBM50336640
Substrate/Competitorn/a
Meas. Tech.ChEMBL_44709 (CHEMBL656598)
Ki 1.2±n/a nM
Citation Di Stilo, AVisentin, SCena, CGasco, AMErmondi, GGasco, A New 1,4-dihydropyridines conjugated to furoxanyl moieties, endowed with both nitric oxide-like and calcium channel antagonist vasodilator activities. J Med Chem41:5393-401 (1999) 
 
Voltage-dependent L-type calcium channel subunit alpha-1D
Name:Voltage-dependent L-type calcium channel subunit alpha-1D
Type:PROTEIN
Mol. Mass.:250148.41
Organism:Rattus norvegicus
Description:ChEMBL_44709
Residue:2203
BDBM50336640
NameBDBM50336640
Synonyms:(nifedipine) 2,6-Dimethyl-4-(2-nitro-phenyl)-1,4-dihydro-pyridine-3,5-dicarboxylic acid dimethyl ester Adalat Afeditab cr NIFEDIPINE Procardia dimethyl 2,6-dimethyl-4-(2-nitrophenyl)-1,4-dihydropyridine-3,5-dicarboxylate
TypeSmall organic molecule
Emp. Form.C17H18N2O6
Mol. Mass.346.3346
SMILESCOC(=O)C1C(C(C(=O)OC)=C(C)N=C1C)c1ccccc1[N+]([O-])=O