Reaction Details
TargetVoltage-dependent L-type calcium channel subunit alpha-1D
LigandBDBM50018796
Substrate/Competitorn/a
Meas. Tech.ChEMBL_44709 (CHEMBL656598)
Ki 1.2±n/a nM
Citation Di Stilo, AVisentin, SCena, CGasco, AMErmondi, GGasco, A New 1,4-dihydropyridines conjugated to furoxanyl moieties, endowed with both nitric oxide-like and calcium channel antagonist vasodilator activities. J Med Chem41:5393-401 (1999) 
 
Voltage-dependent L-type calcium channel subunit alpha-1D
Name:Voltage-dependent L-type calcium channel subunit alpha-1D
Type:PROTEIN
Mol. Mass.:250148.41
Organism:Rattus norvegicus
Description:ChEMBL_44709
Residue:2203
BDBM50018796
NameBDBM50018796
Synonyms:2,6-Dimethyl-4-(3-nitro-phenyl)-1,4-dihydro-pyridine-3,5-dicarboxylic acid dimethyl ester | CHEMBL25676
TypeSmall organic molecule
Emp. Form.C17H18N2O6
Mol. Mass.346.3346
SMILESCOC([O-])=C1C(C(C(=[OH+])OC)=C(C)N=C1C)c1cccc(c1)[N+]([O-])=O