Reaction Details
TargetVoltage-dependent L-type calcium channel subunit alpha-1D
LigandBDBM50072812
Substrate/Competitorn/a
Meas. Tech.ChEMBL_44709 (CHEMBL656598)
Ki 320±n/a nM
Citation Di Stilo, AVisentin, SCena, CGasco, AMErmondi, GGasco, A New 1,4-dihydropyridines conjugated to furoxanyl moieties, endowed with both nitric oxide-like and calcium channel antagonist vasodilator activities. J Med Chem41:5393-401 (1999) 
 
Voltage-dependent L-type calcium channel subunit alpha-1D
Name:Voltage-dependent L-type calcium channel subunit alpha-1D
Type:PROTEIN
Mol. Mass.:250148.41
Organism:Rattus norvegicus
Description:ChEMBL_44709
Residue:2203
BDBM50072812
NameBDBM50072812
Synonyms:2,6-Dimethyl-4-[3-(4-methyl-furazan-3-ylmethoxy)-phenyl]-1,4-dihydro-pyridine-3,5-dicarboxylic acid dimethyl ester | CHEMBL150921
TypeSmall organic molecule
Emp. Form.C21H23N3O6
Mol. Mass.413.4238
SMILESCOC(=O)C1C(C(C(=O)OC)=C(C)N=C1C)c1cccc(OCc2nonc2C)c1