Reaction Details
TargetVoltage-dependent L-type calcium channel subunit alpha-1D
LigandBDBM50072815
Substrate/Competitorn/a
Meas. Tech.ChEMBL_44709 (CHEMBL656598)
Ki 670±n/a nM
Citation Di Stilo, AVisentin, SCena, CGasco, AMErmondi, GGasco, A New 1,4-dihydropyridines conjugated to furoxanyl moieties, endowed with both nitric oxide-like and calcium channel antagonist vasodilator activities. J Med Chem41:5393-401 (1999) 
 
Voltage-dependent L-type calcium channel subunit alpha-1D
Name:Voltage-dependent L-type calcium channel subunit alpha-1D
Type:PROTEIN
Mol. Mass.:250148.41
Organism:Rattus norvegicus
Description:ChEMBL_44709
Residue:2203
BDBM50072815
NameBDBM50072815
Synonyms:4-[2-(4-Carbamoyl-5-oxy-furazan-3-ylmethoxy)-phenyl]-2,6-dimethyl-1,4-dihydro-pyridine-3,5-dicarboxylic acid dimethyl ester | CHEMBL150469
TypeSmall organic molecule
Emp. Form.C21H22N4O8
Mol. Mass.458.4214
SMILESCOC(=O)C1=C(C)[N-]C(C)=C(C1c1ccccc1OCc1no[n+]([O-])c1C(N)=O)C(=[OH+])OC