Reaction Details
TargetProgesterone receptor
LigandBDBM50062438
Substrate/Competitorn/a
Meas. Tech.ChEMBL_159558 (CHEMBL765846)
Ki 0.550000±n/a nM
Citation Edwards, JPWest, SJMarschke, KBMais, DEGottardis, MMJones, TK 5-Aryl-1,2-dihydro-5H-chromeno[3,4-f]quinolines as potent, orally active, nonsteroidal progesterone receptor agonists: the effect of D-ring substituents. J Med Chem41:303-10 (1998) 
 
Progesterone receptor
Name:Progesterone receptor
Type:Protein
Mol. Mass.:98979.52
Organism:Homo sapiens (Human)
Description:P06401
Residue:933
BDBM50062438
NameBDBM50062438
Synonyms:9-Chloro-2,2,4-trimethyl-5-m-tolyl-2,5-dihydro-1H-6-oxa-1-aza-chrysene | CHEMBL319915
TypeSmall organic molecule
Emp. Form.C26H24ClNO
Mol. Mass.401.928
SMILESCC1=CC(C)(C)Nc2ccc3-c4cc(Cl)ccc4OC(c4cccc(C)c4)c3c12