Reaction Details
TargetProgesterone receptor
LigandBDBM50062435
Substrate/Competitorn/a
Meas. Tech.ChEMBL_159052 (CHEMBL760814)
EC50 270±n/a nM
Citation Edwards, JPWest, SJMarschke, KBMais, DEGottardis, MMJones, TK 5-Aryl-1,2-dihydro-5H-chromeno[3,4-f]quinolines as potent, orally active, nonsteroidal progesterone receptor agonists: the effect of D-ring substituents. J Med Chem41:303-10 (1998) 
 
Progesterone receptor
Name:Progesterone receptor
Type:Protein
Mol. Mass.:98979.52
Organism:Homo sapiens (Human)
Description:P06401
Residue:933
BDBM50062435
NameBDBM50062435
Synonyms:9-Fluoro-5-(4-methoxy-phenyl)-2,2,4-trimethyl-2,5-dihydro-1H-6-oxa-1-aza-chrysene | CHEMBL104451
TypeSmall organic molecule
Emp. Form.C26H24FNO2
Mol. Mass.401.4727
SMILESCOc1ccc(cc1)C1Oc2ccc(F)cc2-c2ccc3NC(C)(C)C=C(C)c3c12