Reaction Details
TargetProgesterone receptor
LigandBDBM50062437
Substrate/Competitorn/a
Meas. Tech.ChEMBL_159052 (CHEMBL760814)
EC50 13±n/a nM
Citation Edwards, JPWest, SJMarschke, KBMais, DEGottardis, MMJones, TK 5-Aryl-1,2-dihydro-5H-chromeno[3,4-f]quinolines as potent, orally active, nonsteroidal progesterone receptor agonists: the effect of D-ring substituents. J Med Chem41:303-10 (1998) 
 
Progesterone receptor
Name:Progesterone receptor
Type:Protein
Mol. Mass.:98979.52
Organism:Homo sapiens (Human)
Description:P06401
Residue:933
BDBM50062437
NameBDBM50062437
Synonyms:9-Chloro-5-(4-methoxy-phenyl)-2,2,4-trimethyl-2,5-dihydro-1H-6-oxa-1-aza-chrysene | CHEMBL322312
TypeSmall organic molecule
Emp. Form.C26H24ClNO2
Mol. Mass.417.927
SMILESCOc1ccc(cc1)C1Oc2ccc(Cl)cc2-c2ccc3NC(C)(C)C=C(C)c3c12