Reaction Details
TargetProthrombin
LigandBDBM50062634
Substrate/Competitorn/a
Meas. Tech.ChEMBL_208889 (CHEMBL814946)
Ki 2.5±n/a nM
Citation Brady, SFStauffer, KJLumma, WCSmith, GMRamjit, HGLewis, SDLucas, BJGardell, SJLyle, EAAppleby, SDCook, JJHolahan, MAStranieri, MTLynch, JJLin, JHChen, IWVastag, KNaylor-Olsen, AMVacca, JP Discovery and development of the novel potent orally active thrombin inhibitor N-(9-hydroxy-9-fluorenecarboxy)prolyl trans-4-aminocyclohexylmethyl amide (L-372,460): coapplication of structure-based design and rapid multiple analogue synthesis on solid support. J Med Chem41:401-6 (1998) 
 
Prothrombin
Name:Prothrombin
Type:Protein
Mol. Mass.:70029.57
Organism:Homo sapiens (Human)
Description:P00734
Residue:622
BDBM50062634
NameBDBM50062634
Synonyms:(S)-1-[3-(4-Hydroxy-phenyl)-2-phenyl-propionyl]-pyrrolidine-2-carboxylic acid (4-amino-cyclohexylmethyl)-amide | CHEMBL434417
TypeSmall organic molecule
Emp. Form.C27H35N3O3
Mol. Mass.449.5851
SMILESNC1CCC(CNC(=O)[C@@H]2CCCN2C(=O)C(Cc2ccc(O)cc2)c2ccccc2)CC1